{"text_format":"1","workbook":"xlsx","n_sheets":6,"sheets":["Notice","Definition des donnees","partenaire-coord","ERD","Modalité de calcul","Syntheses"],"not_rendered":{"charts":0,"images":0,"macros":1,"external_links":1,"defined_names":95,"comments":2,"pivot_tables":0},"unopened":[],"bounds":{"document_bytes":16777216,"sheet_cells":100000,"rows_first":2000,"rows_last":500,"rows_between":2000,"halvings":0,"cell_chars":16384,"cell_head_chars":4096},"cells_cut":0,"cells_raw":0,"read":"whole","date_system":"1900"}

{"sheet":"Notice","index":0,"n_rows":51,"n_cols":1,"rows_kept":51,"cut":false,"hidden":false,"merged":[[51,0,51,6],[21,0,21,6],[0,0,0,6],[1,0,1,6],[2,0,2,6],[3,0,5,6],[6,0,8,6],[9,0,10,6],[12,0,12,6],[14,0,14,6],[15,0,17,6],[18,0,18,6],[20,0,20,6],[19,0,19,6],[40,0,41,6],[22,0,22,6],[24,0,24,6],[26,0,29,6],[30,0,30,6],[33,0,33,6],[34,0,34,6],[35,0,35,6],[36,0,37,6],[38,0,38,6],[39,0,39,6],[31,0,32,6],[50,0,50,6],[43,0,43,6],[44,0,44,6],[45,0,45,6],[46,0,47,6],[48,0,48,6],[49,0,49,6]]}
["NOTICE"]
["Ce fichier constitue le volet financier du dépôt d'une demande d'aide par le porteur de projet. Seule la transmission des 3 volets complets (volet administratif, volet technique et volet financier) fera l’objet d’un examen de la demande"]
["LES AIDES DE L’ADEME ET DE L'OFB  NE CONSTITUENT PAS UN DROIT A DELIVRANCE ET N’ONT PAS DE CARACTERE SYSTEMATIQUE"]
["La présente demande sera instruite conformément aux dispositions des règles générales d’attribution des aides de l’ADEME et de l'OFB et le montant de l’aide calculé conformément à leurs systèmes d’aides à la connaissance."]
[]
[]
[]
[]
[]
["Le financement des projets se fera par voie de subvention."]
[]
[]
["Notice technique de remplissage"]
[]
["Ce fichier est programmé pour fonctionner au maximum avec 14 partenaires et 7 lots : 1 onglet par partenaire dont le 1er est réservé au coordinateur du projet. L'onglet \"synthèses\" est généré automatiquement et agrège les coûts par partenaires, types de recherche, lots et types de dépenses."]
{"$rows_left_out":37}
{"sheet":"Definition des donnees","index":1,"n_rows":82,"n_cols":2,"rows_kept":82,"cut":false,"hidden":true,"merged":[]}
[]
["Choix"]
["X"]
[]
[]
["Choix ( oui/non )"]
["Oui"]
["Non"]
[]
["Effectif"]
["< 50 salariés"]
["50 à 249 salariés"]
[">= 250 salariés"]
[]
["Support juridique"]
{"$rows_left_out":68}
{"sheet":"partenaire-coord","index":2,"n_rows":307,"n_cols":61,"rows_kept":307,"cut":false,"hidden":false,"merged":[[105,11,105,12],[82,13,82,14],[105,13,105,14],[56,11,56,12],[15,13,16,14],[56,13,56,14],[15,9,15,12],[16,9,16,12],[268,5,268,8],[274,13,274,14],[285,1,285,2],[277,1,277,2],[265,14,269,14],[265,13,269,13],[284,1,284,2],[276,1,276,2],[272,0,272,4],[274,1,274,2],[283,1,283,2],[271,0,271,2],[266,5,266,8],[265,5,265,8],[275,1,275,2],[267,5,267,8],[281,1,281,2],[302,1,302,4],[293,15,294,17],[278,1,278,2],[279,1,279,2],[280,1,280,2],[301,1,301,4],[301,5,301,6],[305,0,305,4],[306,0,306,4],[286,1,286,2],[299,1,299,4],[287,1,287,2],[300,1,300,4],[288,1,288,2],[290,0,290,8],[300,5,300,6],[297,0,297,6],[299,5,299,6],[304,0,304,4],[296,5,296,6],[296,1,296,4],[298,5,298,6],[302,5,302,6],[155,0,155,12],[250,0,250,4],[264,5,264,8],[259,1,259,2],[225,0,225,4],[242,0,242,4],[257,0,257,4],[263,5,263,8],[3,1,3,3],[127,0,127,4],[125,0,125,4],[15,1,15,4],[5,0,5,1],[16,1,16,4],[6,3,6,5],[6,0,6,1],[105,3,105,4],[15,5,15,8],[16,5,16,8],[144,1,144,2],[145,1,145,2],[142,1,142,2],[143,1,143,2],[252,0,252,4],[156,0,156,12],[154,0,154,12],[164,7,164,8],[164,9,164,10],[164,5,164,6],[164,3,164,4],[164,1,164,2],[146,1,146,2],[153,0,153,12],[148,0,148,8],[164,11,164,12],[132,13,132,14],[133,1,133,2],[56,3,56,4],[141,1,141,2],[136,1,136,2],[132,1,132,2],[137,1,137,2],[138,1,138,2],[139,1,139,2],[135,1,135,2],[82,3,82,4],[134,1,134,2],[105,7,105,8],[82,11,82,12],[56,7,56,8],[82,7,82,8]]}
["Afficher les cellules de saisie en jaune :",null,"OUI",null,null,null,null,{"$f":"IF('partenaire-coord'!#REF!,0,1)","v":{"$error":"#REF!"}},null,null,null,null,null,null,null,null,null,null,null,null,null,null,null,null,null,null,null,null,null,null,null,null,null,null,null,null,null,null,null,null,null,null,null,null,null,null,"Oui"]
["N° du contrat (à renseigner par le bénéficiaire seulement s'il s'agit d'une demande d'avenant:)",null,null,null,null,null,null,null,null,null,null,null,null,null,null,null,null,null,null,null,null,null,null,null,null,null,null,null,null,null,null,null,null,null,null,null,null,null,null,null,null,null,null,null,null,null,"Non"]
["Avenant :",null,null,null,"Régime cadre temporaire COVID :",null,{"$f":"IF(Ch_categ=\"Non économique\",\"Non économique : Régime COVID non applicable\",\"\")","v":"Non économique : Régime COVID non applicable"},null,null,"<- veuillez retrouver tous les éléments à saisir dans OPALE"]
["Bénéficiaire :",null,null,null,"Type de bénéficiaire :"]
["Nom du projet ( acronyme )",null,null,null,"Nom du laboratoire :"]
["Opération réalisée dans le cadre d'une activité :",null,"Non économique",null,"Qui êtes-vous ?","Porteur de projet",{"$f":"IF(C6=\"\",\"Veuillez indiquer l'activité.\",\"\")","v":""}]
["Catégorie d'entreprise",null,"Petite entreprise",{"$f":"IF('partenaire-coord'!$C$7=\"PETITE ENTREPRISE\",\"effectif<50 et CA ou total bilan<=10 M€\",IF('partenaire-coord'!$C$7=\"MOYENNE ENTREPRISE\",\"50<=effectif<250 et 10M€<CA<=50M€ ou 10M€<total bilan<=43M€\",IF('partenaire-coord'!$C$7=\"GRANDE ENTREPRISE\",\"effectif>=250 et CA>50M€\",IF(C7=\"\",\"\"))))","v":"effectif<50 et CA ou total bilan<=10 M€"}]
["Nombre de lot(s) pour le projet",null,3," <- Permet de choisir le nombre de lot pour le projet. Le fichier est limité à 7 lots"]
["Nombre de partenaire pour le projet",null,1," <- Permet de choisir le nombre de partenaire pour le projet. Le fichier est limité à 14 partenaires (1 onglet par partenaire), le 1er onglet est réservé au coordinateur"]
[]
[]
["Coût total de l’opération et  dépenses éligibles PAR LOT(S) (1)"]
["(ne sont admissibles que les coûts découlant directement des activités de recherche)"]
["Pour cette opération, êtes-vous assujeti à la TVA ?"]
["A - DEPENSES DE FONCTIONNEMENT"]
{"$rows_left_out":293}
{"sheet":"ERD","index":3,"n_rows":534,"n_cols":21,"rows_kept":534,"cut":false,"hidden":true,"merged":[[306,12,306,13],[308,12,308,13],[307,12,307,13],[320,12,320,13],[319,12,319,13],[321,12,321,13],[466,1,466,3],[310,12,310,13],[311,12,311,13],[312,12,312,13],[313,12,313,13],[314,12,314,13],[315,12,315,13],[316,12,316,13],[317,12,317,13],[318,12,318,13],[407,12,407,13],[408,12,408,13],[410,12,410,13],[392,12,392,13],[393,12,393,13],[394,12,394,13],[280,2,280,5],[280,6,280,11],[282,12,282,13],[284,12,284,13],[285,12,285,13],[286,12,286,13],[287,12,287,13],[288,12,288,13],[289,12,289,13],[227,12,227,13],[228,12,228,13],[230,12,230,13],[379,12,379,13],[380,12,380,13],[381,12,381,13],[382,12,382,13],[383,12,383,13],[385,12,385,13],[290,12,290,13],[291,12,291,13],[292,12,292,13],[293,12,293,13],[295,12,295,13],[294,12,294,13],[297,12,297,13],[298,12,298,13],[299,12,299,13],[300,12,300,13],[301,12,301,13],[302,12,302,13],[303,12,303,13],[304,12,304,13],[305,12,305,13],[136,12,136,13],[137,12,137,13],[138,12,138,13],[140,12,140,13],[199,12,199,13],[200,12,200,13],[201,12,201,13],[202,12,202,13],[203,12,203,13],[109,12,109,13],[111,12,111,13],[112,12,112,13],[113,12,113,13],[115,12,115,13],[122,12,122,13],[123,12,123,13],[124,12,124,13],[135,12,135,13],[110,12,110,13],[117,12,117,13],[125,12,125,13],[126,12,126,13],[128,12,128,13],[127,12,127,13],[130,12,130,13],[131,12,131,13],[132,12,132,13],[35,12,35,13],[36,12,36,13],[45,12,45,13],[46,12,46,13],[47,12,47,13],[48,12,48,13],[50,12,50,13],[38,12,38,13],[19,12,19,13],[20,12,20,13],[21,12,21,13],[22,12,22,13],[23,12,23,13],[25,12,25,13],[32,12,32,13],[33,12,33,13],[34,12,34,13],[1,0,1,13],[2,0,2,13],[10,2,10,5],[10,6,10,11],[12,12,12,13],[462,1,462,3],[463,1,463,3],[15,12,15,13],[16,12,16,13],[17,12,17,13],[18,12,18,13],[24,12,24,13],[27,12,27,13],[28,12,28,13],[29,12,29,13],[30,12,30,13],[108,12,108,13],[114,12,114,13],[31,12,31,13],[37,12,37,13],[105,12,105,13],[44,12,44,13],[49,12,49,13],[106,12,106,13],[107,12,107,13],[531,1,531,13],[512,0,512,13],[4,12,4,13],[14,12,14,13],[40,12,40,13],[41,12,41,13],[42,12,42,13],[43,12,43,13],[51,12,51,13],[100,2,100,5],[100,6,100,11],[102,12,102,13],[104,12,104,13],[464,1,464,3],[465,1,465,3],[467,1,467,3],[118,12,118,13],[119,12,119,13],[120,12,120,13],[121,12,121,13],[139,12,139,13],[141,12,141,13],[411,12,411,13],[190,2,190,5],[401,12,401,13],[402,12,402,13],[372,12,372,13],[190,6,190,11],[192,12,192,13],[370,2,370,5],[370,6,370,11],[223,12,223,13],[224,12,224,13],[220,12,220,13],[221,12,221,13],[222,12,222,13],[387,12,387,13],[205,12,205,13],[212,12,212,13],[213,12,213,13],[214,12,214,13],[215,12,215,13],[216,12,216,13],[218,12,218,13],[225,12,225,13],[226,12,226,13],[395,12,395,13],[524,0,524,13],[133,12,133,13],[134,12,134,13],[208,12,208,13],[209,12,209,13],[210,12,210,13],[194,12,194,13],[195,12,195,13],[196,12,196,13],[197,12,197,13],[198,12,198,13],[204,12,204,13],[207,12,207,13],[211,12,211,13],[217,12,217,13],[520,0,520,11],[509,0,509,13],[510,0,510,13],[388,12,388,13],[389,12,389,13],[503,0,503,13],[505,0,505,11],[229,12,229,13],[231,12,231,13],[498,4,498,5],[403,12,403,13],[390,12,390,13],[391,12,391,13],[397,12,397,13],[400,12,400,13],[404,12,404,13],[409,12,409,13],[374,12,374,13],[495,4,495,5],[460,4,460,5],[460,6,460,10],[486,0,486,11],[491,0,491,13],[493,4,493,5],[375,12,375,13],[376,12,376,13],[377,12,377,13],[378,12,378,13],[384,12,384,13],[396,12,396,13],[398,12,398,13],[405,12,405,13],[406,12,406,13]]}
["Debut impression",0.2,{"$f":"INDIRECT(\"'\"&$M$5&\"'!C2\")","v":0}]
["4. Modèle d'Etat Récapitulatif des Dépenses (ERD)"]
[{"$f":"\"Contrat de financement n° \"&C1","v":"Contrat de financement n° 0"}]
[]
[null,"þ","Etat global",null,"établi pour la période du :",null,null,null,"au :",null,null,"Partenaire :","partenaire-coord"]
[]
["Si les factures sont en devise : afficher et indiquer le montant en devise, le taux de change dans les colonnes G et H et le montant en euro dans la colonne K.\n",null,null,null,null,null,null,null,null,null,null,null,"↑ Permet de choisir l'ERD du partenaire."]
[]
["Recherche fondamentale et recherche en connaissances nouvelles",null,null,null,null,null,null,null,null,null,null,null,null,null,null,null,null,null,null,null,{"$f":"IF(U52+U75+U89+U93>0,1,0)","v":0}]
[null,null,null,null,null,null,null,null,null,null,null,null,null,null,null,null,null,null,null,null,{"$f":"U9","v":0}]
[null,"Début personnel ERD","Prévisionnel (extrait de l'annexe fi.)",null,null,null,"Dépenses réalisées (à compléter par le bénéficiaire)",null,null,null,null,null,null,null,null,null,null,null,null,null,{"$f":"U9","v":0}]
[null,null,null,null,{"$f":"IF(A9=\"Recherche fondamentale et recherche en connaissances nouvelles\",\"Cout total 1\",IF(A9=\"recherche industrielle\",\"Cout total 2\",IF(A9=\"Développement expérimental\",\"Cout total 3\",IF(A9=\"Innovation en faveur des PME\",\"Cout total 4\",\"Coût Total\"))))","v":"Cout total 1"},{"$f":"IF(A9=\"Recherche fondamentale et recherche en connaissances nouvelles\",\"Depenses eligibles 1\",IF(A9=\"recherche industrielle\",\"Depenses eligibles 2\",IF(A9=\"Développement expérimental\",\"Depenses eligibles 3\",IF(A9=\"Innovation en faveur des PME\",\"Depenses eligibles 4\",\"Dépenses éligibles \"))))","v":"Depenses eligibles 1"},null,null,null,null,null,null,null,null,null,null,null,null,null,null,{"$f":"IF(SUM(C12:F12)>0,1,0)","v":0}]
["Details des couts",null,{"$f":"IFERROR(INDIRECT(\"'\"&$M$5&\"'!B18\"),\"\")","v":"Nombre de mois"},{"$f":"IFERROR(VLOOKUP(C13,'Definition des donnees'!$A$46:$B$48,2,FALSE) & IF(A9=\"Recherche fondamentale et recherche en connaissances nouvelles\",\" (1)\",IF(A9=\"recherche industrielle\",\" (2)\",IF(A9=\"Développement expérimental\",\" (3)\",IF(A9=\"Innovation en faveur des PME\",\" (4)\",\"Coût Total HTR\")))),\"'\")","v":"€ / mois (1)"},"Coût total de l'opération","Dépenses éligibles à justifier","Montant en devise","Taux de change",{"$f":"C13","v":"Nombre de mois"},{"$f":"VLOOKUP(I13,'Definition des donnees'!$A$46:$B$48,2,FALSE)","v":"€ / mois"},"Coût total de l'opération","Dépenses éligibles à justifier","Cadre réservé à l'ADEME",null,null,null,null,null,null,null,{"$f":"IF(SUM(C52:F52)>0,1,0)","v":0}]
[{"$f":"'Definition des donnees'!$A$41","v":"Dépenses de personnel titulaire du statut général des fonctionnaires"},null,null,null,null,null,null,null,null,null,null,null,{"$f":"IF(L14>K14,\"Les dépenses éligibles ne peuvent pas être supérieures au coût total\",\"\")","v":""},null,null,null,null,null,null,null,{"$f":"IF(SUM(U15:U26)>0,1,0)","v":0}]
[null,{"$f":"INDIRECT(\"'\"&$M$5&\"'!A20\")","v":"Directeur de recherche"},{"$f":"SUMIFS(INDIRECT(\"'\"&$M$5&\"'!20:20\"),INDIRECT(\"'\"&$M$5&\"'!$17:$17\"),A9,INDIRECT(\"'\"&$M$5&\"'!$18:$18\"),C13)","v":0},{"$f":"SUMIF(INDIRECT(\"'\"&$M$5&\"'!$18:$18\"),D13,INDIRECT(\"'\"&$M$5&\"'!20:20\"))","v":0},{"$f":"SUMIF(INDIRECT(\"'\"&$M$5&\"'!$18:$18\"),E12,INDIRECT(\"'\"&$M$5&\"'!20:20\"))","v":0},null,null,null,null,null,{"$f":"I15*J15","v":0},null,{"$f":"IF(L15>K15,\"Les dépenses éligibles ne peuvent pas être supérieures au coût total\",IF(AND(OR(E15<>\"\",E15<>0),K15>E15*1.1),\"Attention, les coûts liés à l'opération sont supérieure de \" & TEXT(((K15/E15)-1), \"0%\")& \" par rapport au prévisionnel.\",\"\"))","v":""},null,null,null,null,null,null,null,{"$f":"IF(SUM(C15:F15)>0,1,0)","v":0}]
{"$rows_left_out":520}
{"sheet":"Modalité de calcul","index":4,"n_rows":120,"n_cols":11,"rows_kept":120,"cut":false,"hidden":true,"merged":[[118,0,118,1],[108,0,108,1],[110,0,110,1],[112,0,112,1],[114,0,114,1],[116,0,116,1],[96,0,96,1],[99,0,99,1],[102,0,102,1],[104,0,104,1],[106,0,106,1],[0,0,0,1],[3,0,3,1],[6,0,6,1],[8,0,8,1],[10,0,10,1],[22,0,22,1],[12,0,12,1],[14,0,14,1],[16,0,16,1],[18,0,18,1],[20,0,20,1],[24,0,24,1],[27,0,27,1],[30,0,30,1],[32,0,32,1],[34,0,34,1],[36,0,36,1],[38,0,38,1],[40,0,40,1],[42,0,42,1],[44,0,44,1],[46,0,46,1],[48,0,48,1],[51,0,51,1],[54,0,54,1],[56,0,56,1],[58,0,58,1],[60,0,60,1],[62,0,62,1],[64,0,64,1],[66,0,66,1],[68,0,68,1],[70,0,70,1],[72,0,72,1],[75,0,75,1],[78,0,78,1],[90,0,90,1],[92,0,92,1],[94,0,94,1],[80,0,80,1],[82,0,82,1],[84,0,84,1],[86,0,86,1],[88,0,88,1]]}
[{"$f":"IF(D1=0,\"\",\"Modalité 1\")","v":""},null,null,{"$f":"IF(AND(A23=0,A4=\"\",A11=0),0,1)","v":0},null,"Cherche :",{"$f":"MID(_xlfn.FORMULATEXT(A4),5,SEARCH(\"!\",_xlfn.FORMULATEXT(A4))-4)","v":"Syntheses!"},null,null,"Actualise :","Syntheses!"]
[null,null,null,{"$f":"IF($D$1=0,0,1)","v":0}]
["Titre :",null,null,{"$f":"IF($D$1=0,0,1)","v":0},null,"Remplace :",{"$f":"MID(_xlfn.FORMULATEXT(H3),5,SEARCH(\"!\",_xlfn.FORMULATEXT(H3))-4)","v":"'partenaire-coord'!"},{"$f":"IF('partenaire-coord'!#REF!,0,1)","v":{"$error":"#REF!"}}]
[{"$f":"IF(Syntheses!B118=0,\"\",Syntheses!A118)","v":""},null,null,0]
[null,null,null,0,null,"Plafond COVID :",2300000]
["Base juridique de l'aide :",null,null,0]
[{"$f":"IF(A4=\"\",\"\",IF(Syntheses!C6=ch_eco,IF(Syntheses!F2=\"Oui\",\"Régime cadre temporaire COVID\",\"Art 29 - Innovation de procédé et d'organisation\"),\"Non économique - réglementation nationale\"))","v":""},null,null,0]
["Nature de l'aide :",null,null,0]
[{"$f":"IF(A4=\"\",\"\",\"Prévisionnel\")","v":""},null,null,0]
["Dépenses éligibles :",null,null,0]
[{"$f":"IF(A4=\"\",0,Syntheses!B118)","v":0},null,null,0]
["Montant de la solution de référence :",null,null,0]
["-",null,null,0]
["Plafond des dépenses",null,null,0]
["-",null,null,0]
{"$rows_left_out":106}
{"sheet":"Syntheses","index":5,"n_rows":76,"n_cols":24,"rows_kept":76,"cut":false,"hidden":false,"merged":[[45,0,45,18],[1,0,1,18],[23,0,23,18],[4,1,4,2],[4,3,4,4],[4,5,4,6],[4,7,4,8],[4,11,4,12],[4,16,5,16],[4,14,5,14],[4,15,5,15],[4,13,5,13],[4,9,4,10],[26,9,26,10],[57,0,57,3],[26,13,26,14],[26,15,26,16],[48,1,48,2],[48,3,48,4],[48,5,48,6],[48,7,48,8],[48,11,48,12],[26,5,26,6],[26,7,26,8],[26,11,26,12],[48,13,48,14],[48,15,48,16],[26,1,26,2],[48,9,48,10],[26,3,26,4]]}
["Nom de champ",null,null,null,null,null,null,null,null,null,null,null,null,null,null,null,null,null,null,null,null,null,null,"x"]
["PLAN DE FINANCEMENT DE L'OPERATION"]
[]
[]
[null,"Recherche fondamentale et recherche en connaissances nouvelles",null,"Recherche industrielle",null,"Développement expérimental",null,"Innovation en faveur des PME",null,"Innovation de procédé et d'organisation",null,"TOTAL OPERATION",null,"MONTANT AIDE ACCORDEE PAR L'ADEME et l'OFB","MONTANT AUTRES FINANCEMENTS","AUTOFINANCEMENT","MONTANT AIDE SOUHAITE",null,null,null,null,null,1]
["Nom des feuilles","Coût Total HTR 1","Dépenses éligibles HTR 1","Coût Total HTR 2","Dépenses éligibles HTR 2","Coût Total HTR 3","Dépenses éligibles HTR 3","Coût Total HTR 4","Dépenses éligibles HTR 4","Coût Total HTR 5","Dépenses éligibles HTR 5","Coût Total HTR","Dépenses éligibles HTR",null,null,null,null,null,null,null,null,null,1]
["partenaire-coord",{"$f":"ROUND(IFERROR(INDIRECT(\"'\"&$A7&\"'!B249\"),0),2)","v":0},{"$f":"ROUND(IFERROR(INDIRECT(\"'\"&$A7&\"'!C249\"),0),2)","v":0},{"$f":"ROUND(IFERROR(INDIRECT(\"'\"&$A7&\"'!D249\"),0),2)","v":0},{"$f":"ROUND(IFERROR(INDIRECT(\"'\"&$A7&\"'!E249\"),0),2)","v":0},{"$f":"ROUND(IFERROR(INDIRECT(\"'\"&$A7&\"'!F249\"),0),2)","v":0},{"$f":"ROUND(IFERROR(INDIRECT(\"'\"&$A7&\"'!G249\"),0),2)","v":0},{"$f":"ROUND(IFERROR(INDIRECT(\"'\"&$A7&\"'!H249\"),0),2)","v":0},{"$f":"ROUND(IFERROR(INDIRECT(\"'\"&$A7&\"'!I249\"),0),2)","v":0},{"$f":"ROUND(IFERROR(INDIRECT(\"'\"&$A7&\"'!J249\"),0),2)","v":0},{"$f":"ROUND(IFERROR(INDIRECT(\"'\"&$A7&\"'!K249\"),0),2)","v":0},{"$f":"ROUND(IFERROR(INDIRECT(\"'\"&$A7&\"'!L249\"),0),2)","v":0},{"$f":"ROUND(IFERROR(INDIRECT(\"'\"&$A7&\"'!M249\"),0),2)","v":0},{"$f":"ROUND(IFERROR(INDIRECT(\"'\"&$A7&\"'!B271\"),0),2)","v":0},{"$f":"ROUND(IFERROR(INDIRECT(\"'\"&$A7&\"'!B282\"),0)+IFERROR(INDIRECT(\"'\"&$A7&\"'!B289\"),0)-N7,2)","v":0},{"$f":"ROUND(L7-N7-O7,2)","v":0},{"$f":"ROUND(IFERROR(INDIRECT(\"'\"&$A7&\"'!B115\"),0),2)","v":0},null,null,null,null,null,1]
[null,{"$f":"ROUND(IFERROR(INDIRECT(\"'\"&$A8&\"'!B249\"),0),2)","v":0},{"$f":"ROUND(IFERROR(INDIRECT(\"'\"&$A8&\"'!C249\"),0),2)","v":0},{"$f":"ROUND(IFERROR(INDIRECT(\"'\"&$A8&\"'!D249\"),0),2)","v":0},{"$f":"ROUND(IFERROR(INDIRECT(\"'\"&$A8&\"'!E249\"),0),2)","v":0},{"$f":"ROUND(IFERROR(INDIRECT(\"'\"&$A8&\"'!F249\"),0),2)","v":0},{"$f":"ROUND(IFERROR(INDIRECT(\"'\"&$A8&\"'!G249\"),0),2)","v":0},{"$f":"ROUND(IFERROR(INDIRECT(\"'\"&$A8&\"'!H249\"),0),2)","v":0},{"$f":"ROUND(IFERROR(INDIRECT(\"'\"&$A8&\"'!I249\"),0),2)","v":0},{"$f":"ROUND(IFERROR(INDIRECT(\"'\"&$A8&\"'!J249\"),0),2)","v":0},{"$f":"ROUND(IFERROR(INDIRECT(\"'\"&$A8&\"'!K249\"),0),2)","v":0},{"$f":"ROUND(IFERROR(INDIRECT(\"'\"&$A8&\"'!L249\"),0),2)","v":0},{"$f":"ROUND(IFERROR(INDIRECT(\"'\"&$A8&\"'!M249\"),0),2)","v":0},{"$f":"ROUND(IFERROR(INDIRECT(\"'\"&$A8&\"'!B271\"),0),2)","v":0},{"$f":"ROUND(IFERROR(INDIRECT(\"'\"&$A8&\"'!B282\"),0)+IFERROR(INDIRECT(\"'\"&$A8&\"'!B289\"),0)-N8,2)","v":0},{"$f":"ROUND(L8-N8-O8,2)","v":0},{"$f":"ROUND(IFERROR(INDIRECT(\"'\"&$A8&\"'!B115\"),0),2)","v":0},null,null,null,null,null,{"$f":"+IF(A8=\"\",0,1)","v":0}]
[null,0,0,0,0,0,0,0,0,0,0,0,0,0,0,0,0,null,null,null,null,null,{"$f":"+IF(A9=\"\",0,1)","v":0}]
[null,0,0,0,0,0,0,0,0,0,0,0,0,0,0,0,0,null,null,null,null,null,0]
[null,0,0,0,0,0,0,0,0,0,0,0,0,0,0,0,0,null,null,null,null,null,0]
[null,0,0,0,0,0,0,0,0,0,0,0,0,0,0,0,0,null,null,null,null,null,0]
[null,0,0,0,0,0,0,0,0,0,0,0,0,0,0,0,0,null,null,null,null,null,0]
[null,0,0,0,0,0,0,0,0,0,0,0,0,0,0,0,0,null,null,null,null,null,0]
[null,0,0,0,0,0,0,0,0,0,0,0,0,0,0,0,0,null,null,null,null,null,0]
{"$rows_left_out":61}